Target
Cytochrome P450 2D6
Ligand
BDBM50206864
Substrate
Meas. Tech.
ChEBML_1629313
IC50
7700±n/a nM
Citation
 Morioka, M 3-Cyano-6-(5-methyl-3-pyrazoloamino) pyridines (Part 2): A dual inhibitor of Aurora kinase and tubulin polymerization. Bioorg Med Chem Lett 26:5860-5862 (2016)  
Target
Name:
Cytochrome P450 2D6
Synonyms:
CP2D6_HUMAN CYP2DL1 Cytochrome P450 2D6 (CYP2D6) P450-DB1
Type:
Protein
Mol. Mass.:
55774.82
Organism:
Homo sapiens (Human)
Description:
P10635
Residue:
497
  
Inhibitor
Name:
BDBM50206864
Synonyms:
CHEMBL3903916
Type:
Small organic molecule
Emp. Form.:
C19H19FN6O
Mol. Mass.:
366.3922
SMILES:
Cc1cc(Nc2cc(C)c(C#N)c(NCCOc3ccccc3F)n2)n[nH]1
: