Target
Ras-related protein Rab-7L1
Ligand
BDBM50206819
Substrate
Meas. Tech.
ChEMBL_1629288 (CHEMBL3871914)
Ki
4±n/a nM
Citation
 Morioka, M 3-Cyano-6-(5-methyl-3-pyrazoloamino) pyridines (Part 2): A dual inhibitor of Aurora kinase and tubulin polymerization. Bioorg Med Chem Lett 26:5860-5862 (2016)  
Target
Name:
Ras-related protein Rab-7L1
Synonyms:
RAB29 RAB7L_HUMAN Ras-related protein Rab-29 | Ras-related protein Rab-7L1
Type:
PROTEIN
Mol. Mass.:
23156.01
Organism:
Homo sapiens (Human)
Description:
ChEMBL_116961
Residue:
203
  
Inhibitor
Name:
BDBM50206819
Synonyms:
CHEMBL3893914
Type:
Small organic molecule
Emp. Form.:
C19H21N7O
Mol. Mass.:
363.4163
SMILES:
Cc1cc(Nc2cc(C)c(C#N)c(NCCOc3ccc(C)nc3)n2)n[nH]1
: