Target
Cytochrome P450 2D6
Ligand
BDBM50343939
Substrate
Meas. Tech.
ChEMBL_1629313 (CHEMBL3871939)
IC50
<50000±n/a nM
Citation
 Morioka, M 3-Cyano-6-(5-methyl-3-pyrazoloamino) pyridines (Part 2): A dual inhibitor of Aurora kinase and tubulin polymerization. Bioorg Med Chem Lett 26:5860-5862 (2016)  
Target
Name:
Cytochrome P450 2D6
Synonyms:
CP2D6_HUMAN CYP2DL1 Cytochrome P450 2D6 (CYP2D6) P450-DB1
Type:
Protein
Mol. Mass.:
55774.82
Organism:
Homo sapiens (Human)
Description:
P10635
Residue:
497
  
Inhibitor
Name:
BDBM50343939
Synonyms:
(S)-2-(6-hydroxy-6-methylheptan-2-ylamino)-4-methyl-6-(5-methyl-1H-pyrazol-3-ylamino)nicotinonitrile | CHEMBL1778663
Type:
Small organic molecule
Emp. Form.:
C19H28N6O
Mol. Mass.:
356.4652
SMILES:
C[C@@H](CCCC(C)(C)O)Nc1nc(Nc2cc(C)n[nH]2)cc(C)c1C#N
: