Target
Amine oxidase [flavin-containing] B
Ligand
BDBM50206876
Substrate
Meas. Tech.
ChEMBL_1629362 (CHEMBL3871988)
IC50
59293±n/a nM
Citation
 Ko?ak, UKnez, DCoquelle, NBrus, BPi?lar, ANachon, FBrazzolotto, XKos, JColletier, JPGobec, S N-Propargylpiperidines with naphthalene-2-carboxamide or naphthalene-2-sulfonamide moieties: Potential multifunctional anti-Alzheimer's agents. Bioorg Med Chem 25:633-645 (2017)  
Target
Name:
Amine oxidase [flavin-containing] B
Synonyms:
AOFB_HUMAN MAOB Monoamine oxidase type B (MAO B) Monoamine oxidase type B (MAOB)
Type:
Protein
Mol. Mass.:
58768.76
Organism:
Homo sapiens (Human)
Description:
P27338
Residue:
520
  
Inhibitor
Name:
BDBM50206876
Synonyms:
CHEMBL3915915
Type:
Small organic molecule
Emp. Form.:
C20H22N2O
Mol. Mass.:
306.4015
SMILES:
O=C(NCC1CCCN(CC#C)C1)c1ccc2ccccc2c1
: