Target
Free fatty acid receptor 1
Ligand
BDBM50207059
Substrate
Meas. Tech.
ChEMBL_1629518 (CHEMBL3872144)
EC50
>10000±n/a nM
Citation
 Adams, GLVelazquez, FJayne, CShah, UMiao, SAshley, ERMadeira, MAkiyama, TEDi Salvo, JSuzuki, TWang, NTruong, QGilbert, EZhou, DVerras, AKirkland, MPachanski, MPowles, MYin, WUjjainwalla, FVenkatraman, SEdmondson, SD Discovery of Chromane Propionic Acid Analogues as Selective Agonists of GPR120 with ACS Med Chem Lett 8:96-101 (2017)  
Target
Name:
Free fatty acid receptor 1
Synonyms:
FFAR1 G-protein Coupled Receptor 40 | GPR40
Type:
G Protein-Coupled Receptor (GPCR)
Mol. Mass.:
31473.32
Organism:
Homo sapiens (Human)
Description:
O14842
Residue:
300
  
Inhibitor
Name:
BDBM50207059
Synonyms:
CHEMBL3932664
Type:
Small organic molecule
Emp. Form.:
C22H23FN4O3
Mol. Mass.:
410.4414
SMILES:
COc1cc(OC2CC2)cc(c1F)-c1ccc2O[C@@H](CCc3nnn[nH]3)CCc2c1
: