Target
Glycogen phosphorylase, liver form
Ligand
BDBM50351158
Substrate
Meas. Tech.
ChEMBL_1630548 (CHEMBL3873254)
Ki
4280000±n/a nM
Citation
 Kantsadi, ALBokor, ÉKun, SStravodimos, GAChatzileontiadou, DSMLeonidas, DDJuhász-Tóth, ÉSzakács, ABatta, GDocsa, TGergely, PSomsák, L Synthetic, enzyme kinetic, and protein crystallographic studies of C-ß-d-glucopyranosyl pyrroles and imidazoles reveal and explain low nanomolar inhibition of human liver glycogen phosphorylase. Eur J Med Chem 123:737-745 (2016)  
Target
Name:
Glycogen phosphorylase, liver form
Synonyms:
Glycogen Phosphorylase (PYGL) Liver glycogen phosphorylase PYGL_HUMAN
Type:
Homodimer
Mol. Mass.:
97153.98
Organism:
Homo sapiens (Human)
Description:
Dimers associate into a tetramer to form the enzymatically active phosphorylase A.
Residue:
847
  
Inhibitor
Name:
BDBM50351158
Synonyms:
CHEMBL423707
Type:
Small organic molecule
Emp. Form.:
C6H12O6
Mol. Mass.:
180.1559
SMILES:
OC[C@H]1O[C@H](O)[C@H](O)[C@@H](O)[C@@H]1O
: