Target
Pancreatic triacylglycerol lipase
Ligand
BDBM50207370
Substrate
Meas. Tech.
ChEBML_1631102
IC50
9580±n/a nM
Citation
 Sridhar, SNGinson, GVenkataramana Reddy, POTantak, MPKumar, DPaul, AT Synthesis, evaluation and molecular modelling studies of 2-(carbazol-3-yl)-2-oxoacetamide analogues as a new class of potential pancreatic lipase inhibitors. Bioorg Med Chem 25:609-620 (2017)  
Target
Name:
Pancreatic triacylglycerol lipase
Synonyms:
LIPP_PIG PNLIP Pancreatic lipase | Pancreatic triacylglycerol lipase
Type:
Enzyme
Mol. Mass.:
50080.69
Organism:
Sus scrofa (Pig)
Description:
P00591
Residue:
450
  
Inhibitor
Name:
BDBM50207370
Synonyms:
CHEMBL3896540
Type:
Small organic molecule
Emp. Form.:
C23H20N2O5
Mol. Mass.:
404.4153
SMILES:
COc1cc(NC(=O)C(=O)c2ccc3[nH]c4ccccc4c3c2)cc(OC)c1OC
: