Target
5-hydroxytryptamine receptor 6
Ligand
BDBM50208214
Substrate
Meas. Tech.
ChEMBL_1632480 (CHEMBL3875272)
Ki
8.0±n/a nM
Citation
 Wieckowska, AKolaczkowski, MBucki, AGodyn, JMarcinkowska, MWieckowski, KZareba, PSiwek, AKazek, GGluch-Lutwin, MMierzejewski, PBienkowski, PSienkiewicz-Jarosz, HKnez, DWichur, TGobec, SMalawska, B Novel multi-target-directed ligands for Alzheimer's disease: Combining cholinesterase inhibitors and 5-HT Eur J Med Chem 124:63-81 (2016)  
Target
Name:
5-hydroxytryptamine receptor 6
Synonyms:
5-HT-6 5-hydroxytryptamine receptor 6 (5-HT-6) 5-hydroxytryptamine receptor 6 (5HT6) HTR6 Serotonin 6 (5-HT6) receptor | Serotonin Receptor 6
Type:
G Protein-Coupled Receptor (GPCR)
Mol. Mass.:
46968.43
Organism:
Homo sapiens (Human)
Description:
P50406
Residue:
440
  
Inhibitor
Name:
BDBM50208214
Synonyms:
CHEMBL3884858
Type:
Small organic molecule
Emp. Form.:
C36H41N5O2S
Mol. Mass.:
607.808
SMILES:
O=S(=O)(c1ccccc1)n1ccc2c(cccc12)N1CCN(CCCCCNc2c3CCCCc3nc3ccccc23)CC1
: