Target
5-hydroxytryptamine receptor 2A
Ligand
BDBM21395
Substrate
Meas. Tech.
ChEMBL_1633600 (CHEMBL3876392)
IC50
0.350±n/a nM
Citation
 Gunia-Krzyzak, AZelaszczyk, DRapacz, AZeslawska, EWaszkielewicz, AMPanczyk, KSloczynska, KPekala, ENitek, WFilipek, BMarona, H Structure-anticonvulsant activity studies in the group of (E)-N-cinnamoyl aminoalkanols derivatives monosubstituted in phenyl ring with 4-Cl, 4-CH Bioorg Med Chem 25:471-482 (2017)  
Target
Name:
5-hydroxytryptamine receptor 2A
Synonyms:
5-HT-2 5-HT2A 5-hydroxytryptamine receptor 2A (5HT-2A) 5HT2A_HUMAN HTR2A | Serotonin receptor 2A
Type:
undefined
Mol. Mass.:
52607.65
Organism:
Homo sapiens (Human)
Description:
P28223
Residue:
471
  
Inhibitor
Name:
BDBM21395
Synonyms:
3-(2-(4-(4-Fluorobenzoyl)piperidinol)ethyl)-2,4(1H,3H)-quinazolinedione CHEMBL1628637 Ketanserin R-41-468 [3H]-Ketanserin
Type:
radiolabeled ligand
Emp. Form.:
C22H22FN3O3
Mol. Mass.:
395.4268
SMILES:
Fc1ccc(cc1)C(=O)C1CCN(CCn2c(=O)[nH]c3ccccc3c2=O)CC1
: