Target
Sodium-dependent noradrenaline transporter
Ligand
BDBM50176062
Substrate
Meas. Tech.
ChEMBL_1633616 (CHEMBL3876408)
IC50
2.8±n/a nM
Citation
 Gunia-Krzyzak, AZelaszczyk, DRapacz, AZeslawska, EWaszkielewicz, AMPanczyk, KSloczynska, KPekala, ENitek, WFilipek, BMarona, H Structure-anticonvulsant activity studies in the group of (E)-N-cinnamoyl aminoalkanols derivatives monosubstituted in phenyl ring with 4-Cl, 4-CH Bioorg Med Chem 25:471-482 (2017)  
Target
Name:
Sodium-dependent noradrenaline transporter
Synonyms:
Monoamine transporter NET Noradrenaline Transporter (NET) Norepinephrine transporter protein (NET) SLC6A2 Sodium-dependent noradrenaline transporter (NET) | Solute carrier family 6 member 2
Type:
Multi-pass membrane protein
Mol. Mass.:
69337.72
Organism:
Homo sapiens (Human)
Description:
P23975
Residue:
617
  
Inhibitor
Name:
BDBM50176062
Synonyms:
3-(5H-dibenzo[a,d][7]annulen-5-yl)-N-methylpropan-1-amine 5-(3-methylaminopropyl)-5H-dibenzo[a,d]cycloheptene CHEMBL668 N-methyl-5H-dibenzo[a,d]cycloheptene-5-propylamine amimetilina
Type:
Small organic molecule
Emp. Form.:
C19H21N
Mol. Mass.:
263.3767
SMILES:
CNCCCC1c2ccccc2C=Cc2ccccc12
: