Target
Sphingosine 1-phosphate receptor 4
Ligand
BDBM50209042
Substrate
Meas. Tech.
ChEMBL_1633657 (CHEMBL3876449)
EC50
38±n/a nM
Citation
 Hur, WRosen, HGray, NS A benzo[b]thiophene-based selective type 4 S1P receptor agonist. Bioorg Med Chem Lett 27:1-5 (2017)  
Target
Name:
Sphingosine 1-phosphate receptor 4
Synonyms:
EDG6 S1P receptor 4 S1P4 S1PR4_HUMAN Sphingosine 1-phosphate receptor Edg-6 sphingosine-1-phosphate 4 S1P4
Type:
G Protein-Coupled Receptor (GPCR)
Mol. Mass.:
41647.39
Organism:
Homo sapiens (Human)
Description:
Residue:
384
  
Inhibitor
Name:
BDBM50209042
Synonyms:
CHEMBL3883972
Type:
Small organic molecule
Emp. Form.:
C22H19NO2S
Mol. Mass.:
361.457
SMILES:
OC(=O)CCNCc1cc2cc(ccc2s1)-c1ccc2ccccc2c1
: