Target
5-hydroxytryptamine receptor 7
Ligand
BDBM50209856
Substrate
Meas. Tech.
ChEMBL_1634226 (CHEMBL3877018)
Ki
327±n/a nM
Citation
 Intagliata, SModica, MNPittalą, VSalerno, LSiracusa, MACagnotto, ASalmona, MKurczab, RRomeo, G New N- and O-arylpiperazinylalkyl pyrimidines and 2-methylquinazolines derivatives as 5-HT Bioorg Med Chem 25:1250-1259 (2017)  
Target
Name:
5-hydroxytryptamine receptor 7
Synonyms:
5-HT-7 5-HT7 5-HT7S 5HT7 HTR7 | Serotonin receptor 7
Type:
G Protein-Coupled Receptor (GPCR)
Mol. Mass.:
53573.08
Organism:
Homo sapiens (Human)
Description:
P34969
Residue:
479
  
Inhibitor
Name:
BDBM50209856
Synonyms:
CHEMBL3885178
Type:
Small organic molecule
Emp. Form.:
C24H29ClN4O
Mol. Mass.:
424.966
SMILES:
Cc1nc2ccccc2c(=O)n1CCCCCN1CCN(CC1)c1ccc(Cl)cc1
: