Target
Carbonic anhydrase 9
Ligand
BDBM50209889
Substrate
Meas. Tech.
ChEMBL_1634232 (CHEMBL3877024)
Ki
2830±n/a nM
Citation
 Kumar, RBua, SRam, SDel Prete, SCapasso, CSupuran, CTSharma, PK Benzenesulfonamide bearing imidazothiadiazole and thiazolotriazole scaffolds as potent tumor associated human carbonic anhydrase IX and XII inhibitors. Bioorg Med Chem 25:1286-1293 (2017)  
Target
Name:
Carbonic anhydrase 9
Synonyms:
CA-IX CAH9_HUMAN Carbonic anhydrase 9 (CA IX) Carbonic anhydrase 9 precursor Carbonic anhydrase IX (CAIX) Carbonic anhydrases; II & IX MN RCC-associated antigen G250
Type:
Enzyme
Mol. Mass.:
49669.03
Organism:
Homo sapiens (Human)
Description:
Catalytic domain of human cloned isozyme was used in the assay
Residue:
459
  
Inhibitor
Name:
BDBM50209889
Synonyms:
CHEMBL3884342
Type:
Small organic molecule
Emp. Form.:
C17H14N4O3S2
Mol. Mass.:
386.448
SMILES:
COc1ccc(cc1)-c1cn2nc(sc2n1)-c1ccc(cc1)S(N)(=O)=O
: