Target
Carbonic anhydrase 9
Ligand
BDBM50209890
Substrate
Meas. Tech.
ChEMBL_1634232 (CHEMBL3877024)
Ki
189±n/a nM
Citation
 Kumar, RBua, SRam, SDel Prete, SCapasso, CSupuran, CTSharma, PK Benzenesulfonamide bearing imidazothiadiazole and thiazolotriazole scaffolds as potent tumor associated human carbonic anhydrase IX and XII inhibitors. Bioorg Med Chem 25:1286-1293 (2017)  
Target
Name:
Carbonic anhydrase 9
Synonyms:
CA-IX CAH9_HUMAN Carbonic anhydrase 9 (CA IX) Carbonic anhydrase 9 precursor Carbonic anhydrase IX (CAIX) Carbonic anhydrases; II & IX MN RCC-associated antigen G250
Type:
Enzyme
Mol. Mass.:
49669.03
Organism:
Homo sapiens (Human)
Description:
Catalytic domain of human cloned isozyme was used in the assay
Residue:
459
  
Inhibitor
Name:
BDBM50209890
Synonyms:
CHEMBL3884122
Type:
Small organic molecule
Emp. Form.:
C16H11N5O4S2
Mol. Mass.:
401.42
SMILES:
NS(=O)(=O)c1ccc(cc1)-c1nc2scc(-c3ccc(cc3)[N+]([O-])=O)n2n1
: