Target
Carbonic anhydrase 2
Ligand
BDBM50210047
Substrate
Meas. Tech.
ChEMBL_1634231 (CHEMBL3877023)
Ki
7.3±n/a nM
Citation
 Kumar, RBua, SRam, SDel Prete, SCapasso, CSupuran, CTSharma, PK Benzenesulfonamide bearing imidazothiadiazole and thiazolotriazole scaffolds as potent tumor associated human carbonic anhydrase IX and XII inhibitors. Bioorg Med Chem 25:1286-1293 (2017)  
Target
Name:
Carbonic anhydrase 2
Synonyms:
CA-II CAC Carbonate dehydratase II Carbonic anhydrase 2 (CA-II) Carbonic anhydrase C Carbonic anhydrase II (CA-II) Carbonic anhydrase II (hCA II) | Carbonic anhydrase isoenzyme II (hCA II)
Type:
Enzyme
Mol. Mass.:
29250.71
Organism:
Homo sapiens (Human)
Description:
P00918
Residue:
260
  
Inhibitor
Name:
BDBM50210047
Synonyms:
CHEMBL3885288
Type:
Small organic molecule
Emp. Form.:
C16H12N4O2S2
Mol. Mass.:
356.422
SMILES:
NS(=O)(=O)c1ccc(cc1)-c1nn2cc(nc2s1)-c1ccccc1
: