Target
Lysine-specific histone demethylase 1A
Ligand
BDBM50210048
Substrate
Meas. Tech.
ChEMBL_1634251 (CHEMBL3877043)
Ki
37000±n/a nM
Citation
 Amano, YUmezawa, NSato, SWatanabe, HUmehara, THiguchi, T Activation of lysine-specific demethylase 1 inhibitor peptide by redox-controlled cleavage of a traceless linker. Bioorg Med Chem 25:1227-1234 (2017)  
Target
Name:
Lysine-specific histone demethylase 1A
Synonyms:
AOF2 Flavin-containing amine oxidase domain-containing protein 2 KDM1A KIAA0601 Lysine-specific demethylase 1 (LSD1) Lysine-specific histone demethylase 1 (LSD1)
Type:
Enzyme
Mol. Mass.:
92901.01
Organism:
Homo sapiens (Human)
Description:
O60341
Residue:
852
  
Inhibitor
Name:
BDBM50210048
Synonyms:
CHEMBL3884919
Type:
Small organic molecule
Emp. Form.:
C57H93N17O14S2
Mol. Mass.:
1304.584
SMILES:
CC(C)C[C@@H]1NC(=O)[C@H](Cc2ccccc2)NC(=O)[C@H](CO)NC(=O)[C@H](CCCNC(N)=N)NC(=O)[C@@H]2CCCN2C(=O)OCCSSCCOC(=O)NCCCC[C@H](NC(=O)[C@H](CCCNC(N)=N)NC(=O)[C@@H](NC1=O)C(C)C)C(=O)N1CCC[C@H]1C(N)=O
: