Target
Free fatty acid receptor 1
Ligand
BDBM50210146
Substrate
Meas. Tech.
ChEMBL_1634352 (CHEMBL3877144)
EC50
3.10±n/a nM
Target
Name:
Free fatty acid receptor 1
Synonyms:
FFAR1 G-protein Coupled Receptor 40 | GPR40
Type:
G Protein-Coupled Receptor (GPCR)
Mol. Mass.:
31473.32
Organism:
Homo sapiens (Human)
Description:
O14842
Residue:
300
  
Inhibitor
Name:
BDBM50210146
Synonyms:
CHEMBL3883819
Type:
Small organic molecule
Emp. Form.:
C28H28FNO4
Mol. Mass.:
461.5246
SMILES:
COc1ccc(F)c(c1)-c1ccc(nc1)C1CCc2ccc(cc2O1)[C@@H]([C@H](C)C(O)=O)C1CC1
: