Target
Free fatty acid receptor 1
Ligand
BDBM50210151
Substrate
Meas. Tech.
ChEMBL_1634352 (CHEMBL3877144)
EC50
101±n/a nM
Target
Name:
Free fatty acid receptor 1
Synonyms:
FFAR1 G-protein Coupled Receptor 40 | GPR40
Type:
G Protein-Coupled Receptor (GPCR)
Mol. Mass.:
31473.32
Organism:
Homo sapiens (Human)
Description:
O14842
Residue:
300
  
Inhibitor
Name:
BDBM50210151
Synonyms:
CHEMBL3883449
Type:
Small organic molecule
Emp. Form.:
C30H31FO5
Mol. Mass.:
490.5625
SMILES:
COCc1cc(ccc1-c1cc(OC)ccc1F)C1CCc2ccc(cc2O1)[C@@H](CC(O)=O)C1CC1
: