Target
Free fatty acid receptor 1
Ligand
BDBM50210159
Substrate
Meas. Tech.
ChEBML_1634352
EC50
139±n/a nM
Target
Name:
Free fatty acid receptor 1
Synonyms:
FFAR1 G-protein Coupled Receptor 40 | GPR40
Type:
G Protein-Coupled Receptor (GPCR)
Mol. Mass.:
31473.32
Organism:
Homo sapiens (Human)
Description:
O14842
Residue:
300
  
Inhibitor
Name:
BDBM50210159
Synonyms:
CHEMBL3883532
Type:
Small organic molecule
Emp. Form.:
C35H37FO4
Mol. Mass.:
540.6643
SMILES:
COc1ccc(F)c(c1)-c1ccc(cc1C1=CCCC1(C)C)C1CCc2ccc(cc2O1)[C@@H](CC(O)=O)C1CC1
: