Target
Free fatty acid receptor 1
Ligand
BDBM50210149
Substrate
Meas. Tech.
ChEBML_1634352
EC50
762±n/a nM
Target
Name:
Free fatty acid receptor 1
Synonyms:
FFAR1 G-protein Coupled Receptor 40 | GPR40
Type:
G Protein-Coupled Receptor (GPCR)
Mol. Mass.:
31473.32
Organism:
Homo sapiens (Human)
Description:
O14842
Residue:
300
  
Inhibitor
Name:
BDBM50210149
Synonyms:
CHEMBL3884609
Type:
Small organic molecule
Emp. Form.:
C33H35FO5
Mol. Mass.:
530.6264
SMILES:
COC(C1CC1)c1cc(ccc1-c1cc(OC)ccc1F)C1CCc2ccc(cc2O1)[C@@H](CC(O)=O)C1CC1
: