Target
Histone deacetylase 6
Ligand
BDBM50210174
Substrate
Meas. Tech.
ChEMBL_1634443 (CHEMBL3877341)
IC50
395±n/a nM
Citation
 Yang, EGMustafa, NTan, ECPoulsen, ARamanujulu, PMChng, WJYen, JJDymock, BW Design and Synthesis of Janus Kinase 2 (JAK2) and Histone Deacetlyase (HDAC) Bispecific Inhibitors Based on Pacritinib and Evidence of Dual Pathway Inhibition in Hematological Cell Lines. J Med Chem 59:8233-62 (2016)  
Target
Name:
Histone deacetylase 6
Synonyms:
Cereblon/Histone deacetylase 6 HDAC6 Histone deacetylase 6 (HDAC6) KIAA0901 | ORF Names:JM21
Type:
Chromatin regulator; hydrolase; repressor
Mol. Mass.:
131381.51
Organism:
Homo sapiens (Human)
Description:
Q9UBN7
Residue:
1215
  
Inhibitor
Name:
BDBM50210174
Synonyms:
CHEMBL3915689
Type:
Small organic molecule
Emp. Form.:
C31H31N5O5
Mol. Mass.:
553.6083
SMILES:
ONC(=O)c1ccc(NCCOc2ccc3Nc4nccc(n4)-c4cccc(COC\C=C\COCc2c3)c4)cc1
: