Target
Cholinesterase
Ligand
BDBM50210843
Substrate
Meas. Tech.
ChEMBL_1634996 (CHEMBL3877894)
IC50
15000±n/a nM
Citation
 de Candia, MZaetta, GDenora, NTricarico, DMajellaro, MCellamare, SAltomare, CD New azepino[4,3-b]indole derivatives as nanomolar selective inhibitors of human butyrylcholinesterase showing protective effects against NMDA-induced neurotoxicity. Eur J Med Chem 125:288-298 (2017)  
Target
Name:
Cholinesterase
Synonyms:
BCHE CHLE_HORSE | Cholinesterase
Type:
Enzyme
Mol. Mass.:
65643.35
Organism:
Equus caballus (Horse)
Description:
P81908
Residue:
574
  
Inhibitor
Name:
BDBM50210843
Synonyms:
CHEMBL3971444
Type:
Small organic molecule
Emp. Form.:
C18H23N3O3
Mol. Mass.:
329.3935
SMILES:
CCOC(=O)NCCCn1c2CCCNC(=O)c2c2ccccc12
: