Target
Acetylcholinesterase
Ligand
BDBM50210837
Substrate
Meas. Tech.
ChEBML_1635380
IC50
112±n/a nM
Citation
 Mishra, CBKumari, SManral, APrakash, ASaini, VLynn, AMTiwari, M Design, synthesis, in-silico and biological evaluation of novel donepezil derivatives as multi-target-directed ligands for the treatment of Alzheimer's disease. Eur J Med Chem 125:736-750 (2017)  
Target
Name:
Acetylcholinesterase
Synonyms:
ACES_ELEEL Acetylcholinesterase (EeAChE) | ache
Type:
Enzyme
Mol. Mass.:
71812.79
Organism:
Electrophorus electricus (Electric eel)
Description:
Residue:
633
  
Inhibitor
Name:
BDBM50210837
Synonyms:
CHEMBL3916256
Type:
Small organic molecule
Emp. Form.:
C30H32N2O3
Mol. Mass.:
468.5867
SMILES:
COc1cc2C\C(=C/c3ccc(cc3)N3CCN(CC3)c3ccc(C)cc3C)C(=O)c2cc1OC
: