Target
Heat shock protein HSP 90-alpha
Ligand
BDBM50008059
Substrate
Meas. Tech.
ChEMBL_1635598 (CHEMBL3878496)
IC50
14±n/a nM
Citation
 Jeong, JHOh, YJLho, YPark, SYLiu, KHHa, ESeo, YH Targeting the entry region of Hsp90's ATP binding pocket with a novel 6,7-dihydrothieno[3,2-c]pyridin-5(4H)-yl amide. Eur J Med Chem 124:1069-1080 (2016)  
Target
Name:
Heat shock protein HSP 90-alpha
Synonyms:
HS90A_HUMAN HSP86 HSP90AA1 HSPCA Heat shock 86 kDa Heat shock protein HSP 90-alpha (HSP90) LAP-2 Lipopolysaccharide-associated protein 2 heat shock protein 90kDa alpha (cytosolic), class A member 1 isoform 2
Type:
Molecular Chaperone
Mol. Mass.:
84623.45
Organism:
Homo sapiens (Human)
Description:
P07900
Residue:
732
  
Inhibitor
Name:
BDBM50008059
Synonyms:
CHEBI:5292 | GELDANAMYCIN
Type:
Small organic molecule
Emp. Form.:
C29H40N2O9
Mol. Mass.:
560.6359
SMILES:
CO[C@H]1C[C@H](C)CC2=C(OC)C(=O)C=C(NC(=O)\C(C)=C\C=C/[C@H](OC)[C@@H](OC(N)=O)\C(C)=C\[C@H](C)[C@H]1O)C2=O
: