Target
Adenosine receptor A2a
Ligand
BDBM50211087
Substrate
Meas. Tech.
ChEMBL_1636012 (CHEMBL3878910)
IC50
0.051000±n/a nM
Citation
 Varano, FCatarzi, DVincenzi, FBetti, MFalsini, MRavani, ABorea, PAColotta, VVarani, K Design, Synthesis, and Pharmacological Characterization of 2-(2-Furanyl)thiazolo[5,4-d]pyrimidine-5,7-diamine Derivatives: New Highly Potent A J Med Chem 59:10564-10576 (2016)  
Target
Name:
Adenosine receptor A2a
Synonyms:
A2A adenosine receptor (hA2A) ADENOSINE A2 ADORA2 Adenosine A2A receptor (A2AAR)
Type:
G Protein-Coupled Receptor (GPCR)
Mol. Mass.:
44716.46
Organism:
Homo sapiens (Human)
Description:
P29274
Residue:
412
  
Inhibitor
Name:
BDBM50211087
Synonyms:
CHEMBL3958838
Type:
Small organic molecule
Emp. Form.:
C17H15N5O2S
Mol. Mass.:
353.398
SMILES:
COc1ccccc1CNc1nc(N)c2nc(sc2n1)-c1ccco1
: