Target
Adenosine receptor A1
Ligand
BDBM50211094
Substrate
Meas. Tech.
ChEMBL_1636003 (CHEMBL3878901)
Ki
45±n/a nM
Citation
 Varano, FCatarzi, DVincenzi, FBetti, MFalsini, MRavani, ABorea, PAColotta, VVarani, K Design, Synthesis, and Pharmacological Characterization of 2-(2-Furanyl)thiazolo[5,4-d]pyrimidine-5,7-diamine Derivatives: New Highly Potent A J Med Chem 59:10564-10576 (2016)  
Target
Name:
Adenosine receptor A1
Synonyms:
A1 adenosine receptor (hA1) AA1R_HUMAN ADORA1 Adenosine A1-receptor Adenosine receptor A1 (hA1) | Adenosine transporter (AdT)
Type:
G Protein-Coupled Receptor (GPCR)
Mol. Mass.:
36520.92
Organism:
Homo sapiens (Human)
Description:
P30542
Residue:
326
  
Inhibitor
Name:
BDBM50211094
Synonyms:
CHEMBL3950142
Type:
Small organic molecule
Emp. Form.:
C16H13N5OS
Mol. Mass.:
323.372
SMILES:
Nc1nc(NCc2ccccc2)nc2sc(nc12)-c1ccco1
: