Target
Adenosine receptor A2a
Ligand
BDBM50211094
Substrate
Meas. Tech.
ChEMBL_1636012 (CHEMBL3878910)
IC50
18±n/a nM
Citation
 Varano, FCatarzi, DVincenzi, FBetti, MFalsini, MRavani, ABorea, PAColotta, VVarani, K Design, Synthesis, and Pharmacological Characterization of 2-(2-Furanyl)thiazolo[5,4-d]pyrimidine-5,7-diamine Derivatives: New Highly Potent A J Med Chem 59:10564-10576 (2016)  
Target
Name:
Adenosine receptor A2a
Synonyms:
A2A adenosine receptor (hA2A) ADENOSINE A2 ADORA2 Adenosine A2A receptor (A2AAR)
Type:
G Protein-Coupled Receptor (GPCR)
Mol. Mass.:
44716.46
Organism:
Homo sapiens (Human)
Description:
P29274
Residue:
412
  
Inhibitor
Name:
BDBM50211094
Synonyms:
CHEMBL3950142
Type:
Small organic molecule
Emp. Form.:
C16H13N5OS
Mol. Mass.:
323.372
SMILES:
Nc1nc(NCc2ccccc2)nc2sc(nc12)-c1ccco1
: