Target
Monoacylglycerol lipase ABHD6
Ligand
BDBM50211262
Substrate
Meas. Tech.
ChEBML_1636272
IC50
398±n/a nM
Citation
 Deng, HKooijman, Svan den Nieuwendijk, AMOgasawara, Dvan der Wel, Tvan Dalen, FBaggelaar, MPJanssen, FJvan den Berg, RJden Dulk, HCravatt, BFOverkleeft, HSRensen, PCvan der Stelt, M Triazole Ureas Act as Diacylglycerol Lipase Inhibitors and Prevent Fasting-Induced Refeeding. J Med Chem 60:428-440 (2017)  
Target
Name:
Monoacylglycerol lipase ABHD6
Synonyms:
ABHD6_MOUSE Abhd6 Monoacylglycerol lipase ABHD6
Type:
Single-pass type II membrane protein; hydrolase
Mol. Mass.:
38216.17
Organism:
Mus musculus (mouse)
Description:
Assays were using membranes of recombinant Abh6 transiently transfected in COS-7 cells.
Residue:
336
  
Inhibitor
Name:
BDBM50211262
Synonyms:
CHEMBL3922787
Type:
Small organic molecule
Emp. Form.:
C29H28F2N4O3
Mol. Mass.:
518.5544
SMILES:
CO[C@H]1CC[C@H](Cc2ccccc2)N(C1)C(=O)n1ncc(n1)C(O)(c1ccc(F)cc1)c1ccc(F)cc1
: