Target
Monoacylglycerol lipase ABHD6
Ligand
BDBM50211240
Substrate
Meas. Tech.
ChEBML_1636269
IC50
40±n/a nM
Citation
 Deng, HKooijman, Svan den Nieuwendijk, AMOgasawara, Dvan der Wel, Tvan Dalen, FBaggelaar, MPJanssen, FJvan den Berg, RJden Dulk, HCravatt, BFOverkleeft, HSRensen, PCvan der Stelt, M Triazole Ureas Act as Diacylglycerol Lipase Inhibitors and Prevent Fasting-Induced Refeeding. J Med Chem 60:428-440 (2017)  
Target
Name:
Monoacylglycerol lipase ABHD6
Synonyms:
2-arachidonoylglycerol hydrolase ABHD6_HUMAN Monoacylglycerol lipase ABHD6
Type:
PROTEIN
Mol. Mass.:
38341.83
Organism:
Homo sapiens (Human)
Description:
ChEMBL_105457
Residue:
337
  
Inhibitor
Name:
BDBM50211240
Synonyms:
CHEMBL3897587
Type:
Small organic molecule
Emp. Form.:
C32H32F2N4O3
Mol. Mass.:
558.6183
SMILES:
OC(c1cnn(n1)C(=O)N1C[C@@H](CC[C@@H]1Cc1ccccc1)OCC1CC1)(c1ccc(F)cc1)c1ccc(F)cc1
: