Target
Diacylglycerol lipase-beta
Ligand
BDBM50211235
Substrate
Meas. Tech.
ChEBML_1636262
IC50
79±n/a nM
Citation
 Deng, HKooijman, Svan den Nieuwendijk, AMOgasawara, Dvan der Wel, Tvan Dalen, FBaggelaar, MPJanssen, FJvan den Berg, RJden Dulk, HCravatt, BFOverkleeft, HSRensen, PCvan der Stelt, M Triazole Ureas Act as Diacylglycerol Lipase Inhibitors and Prevent Fasting-Induced Refeeding. J Med Chem 60:428-440 (2017)  
Target
Name:
Diacylglycerol lipase-beta
Synonyms:
DGL-beta Daglb | Sn1-specific diacylglycerol lipase beta
Type:
PROTEIN
Mol. Mass.:
73906.34
Organism:
Mus musculus
Description:
ChEMBL_101275
Residue:
669
  
Inhibitor
Name:
BDBM50211235
Synonyms:
CHEMBL3974512
Type:
Small organic molecule
Emp. Form.:
C28H28N4O2
Mol. Mass.:
452.5475
SMILES:
OC(c1cn(nn1)C(=O)N1CCCCC1Cc1ccccc1)(c1ccccc1)c1ccccc1
: