Target
Dihydroorotate dehydrogenase (quinone), mitochondrial
Ligand
BDBM50211714
Substrate
Meas. Tech.
ChEMBL_1636657 (CHEMBL3879555)
Ki
26100±n/a nM
Citation
 Inaoka, DKIida, MHashimoto, STabuchi, TKuranaga, TBalogun, EOHonma, TTanaka, AHarada, SNara, TKita, KInoue, M Design and synthesis of potent substrate-based inhibitors of the Trypanosoma cruzi dihydroorotate dehydrogenase. Bioorg Med Chem 25:1465-1470 (2017)  
Target
Name:
Dihydroorotate dehydrogenase (quinone), mitochondrial
Synonyms:
DHODH Dihydroorotate dehydrogenase Dihydroorotate dehydrogenase, mitochondrial Dihydroorotate oxidase (DHODH) | PYRD_HUMAN
Type:
Enzyme
Mol. Mass.:
42881.33
Organism:
Homo sapiens (Human)
Description:
Q02127
Residue:
395
  
Inhibitor
Name:
BDBM50211714
Synonyms:
CHEMBL3938624
Type:
Small organic molecule
Emp. Form.:
C23H27N3O7
Mol. Mass.:
457.4764
SMILES:
NCCO.COC(=O)c1ccc2cc(CCCCc3c([nH]c(=O)[nH]c3=O)C(O)=O)ccc2c1
: