Target
Dihydroorotate dehydrogenase (quinone), mitochondrial
Ligand
BDBM50211727
Substrate
Meas. Tech.
ChEMBL_1636657 (CHEMBL3879555)
Ki
485±n/a nM
Citation
 Inaoka, DKIida, MHashimoto, STabuchi, TKuranaga, TBalogun, EOHonma, TTanaka, AHarada, SNara, TKita, KInoue, M Design and synthesis of potent substrate-based inhibitors of the Trypanosoma cruzi dihydroorotate dehydrogenase. Bioorg Med Chem 25:1465-1470 (2017)  
Target
Name:
Dihydroorotate dehydrogenase (quinone), mitochondrial
Synonyms:
DHODH Dihydroorotate dehydrogenase Dihydroorotate dehydrogenase, mitochondrial Dihydroorotate oxidase (DHODH) | PYRD_HUMAN
Type:
Enzyme
Mol. Mass.:
42881.33
Organism:
Homo sapiens (Human)
Description:
Q02127
Residue:
395
  
Inhibitor
Name:
BDBM50211727
Synonyms:
CHEMBL3974614
Type:
Small organic molecule
Emp. Form.:
C21H23N3O5
Mol. Mass.:
397.4244
SMILES:
NCCO.OC(=O)c1[nH]c(=O)[nH]c(=O)c1CCc1ccc(cc1)-c1ccccc1
: