Target
cAMP-dependent protein kinase catalytic subunit gamma
Ligand
BDBM50054421
Substrate
Meas. Tech.
ChEMBL_161896 (CHEMBL772605)
IC50
>100000±n/a nM
Citation
  TBA Bioorg Med Chem Lett 2:449-452 (1992)   
Target
Name:
cAMP-dependent protein kinase catalytic subunit gamma
Synonyms:
KAPCG_HUMAN PRKACG cAMP-dependent protein kinase catalytic subunit gamma
Type:
PROTEIN
Mol. Mass.:
40442.03
Organism:
Homo sapiens (Human)
Description:
ChEMBL_104720
Residue:
351
  
Inhibitor
Name:
BDBM50054421
Synonyms:
1,11-dichloro-6,7,12,13-tetrahydro-5H-indolo[2,3-a]pyrrolo[3,4-c]carbazole-5,7-dione | CHEMBL139517
Type:
Small organic molecule
Emp. Form.:
C20H9Cl2N3O2
Mol. Mass.:
394.21
SMILES:
Clc1cccc2c1[nH]c1c3[nH]c4c(Cl)cccc4c3c3C(=O)NC(=O)c3c21
: