Target
cAMP-dependent protein kinase catalytic subunit gamma
Ligand
BDBM2581
Substrate
Meas. Tech.
ChEMBL_161896 (CHEMBL772605)
IC50
25700±n/a nM
Citation
  TBA Bioorg Med Chem Lett 2:449-452 (1992)   
Target
Name:
cAMP-dependent protein kinase catalytic subunit gamma
Synonyms:
KAPCG_HUMAN PRKACG cAMP-dependent protein kinase catalytic subunit gamma
Type:
PROTEIN
Mol. Mass.:
40442.03
Organism:
Homo sapiens (Human)
Description:
ChEMBL_104720
Residue:
351
  
Inhibitor
Name:
BDBM2581
Synonyms:
3,13,23-triazahexacyclo[14.7.0.0^{2,10}.0^{4,9}.0^{11,15}.0^{17,22}]tricosa-1(16),2(10),4(9),5,7,11(15),17(22),18,20-nonaen-12-one K-252c
Type:
Small organic molecule
Emp. Form.:
C20H13N3O
Mol. Mass.:
311.3367
SMILES:
O=C1NCc2c1c1c3ccccc3[nH]c1c1[nH]c3ccccc3c21
: