Target
DNA gyrase subunit A/B
Ligand
BDBM7457
Substrate
Meas. Tech.
ChEMBL_75871 (CHEMBL687258)
IC50
289000±n/a nM
Citation
  TBA Bioorg Med Chem Lett 3:225-230 (1993)   
Target
Name:
DNA gyrase subunit A/B
Synonyms:
DNA Gyrase | DNA gyrase A/B
Type:
A2B2 tetramer
Mol. Mass.:
Description:
Components:
This complex has 2 components.
Component 1
Name:
DNA gyrase subunit A
Synonyms:
DNA gyrase GYRA_ECOLI hisW parD
Type:
Enzyme Subunit
Mol. Mass.:
96935.15
Organism:
Escherichia coli (strain K12)
Description:
Residue:
875
  
Component 2
Name:
DNA gyrase subunit B
Synonyms:
DNA gyrase subunit B GYRB_ECOLI acrB gyrB hisU parA | pcbA
Type:
Enzyme Subunit
Mol. Mass.:
89941.28
Organism:
Escherichia coli (strain K12)
Description:
P0AES6
Residue:
804
  
Inhibitor
Name:
BDBM7457
Synonyms:
2-(3,4-dihydroxyphenyl)-3,7-dihydroxy-4H-chromen-4-one 2-(3,4-dihydroxyphenyl)-3,7-dihydroxy-chromone;dihydrate Fisetin (14) fisetin
Type:
Small organic molecule
Emp. Form.:
C15H10O6
Mol. Mass.:
286.2363
SMILES:
Oc1ccc2c(c1)oc(-c1ccc(O)c(O)c1)c(O)c2=O
: