Target
Substance-K receptor
Ligand
BDBM50212987
Substrate
Meas. Tech.
ChEMBL_209206 (CHEMBL817333)
Ki
0.316228±n/a nM
Citation
  TBA Bioorg Med Chem Lett 4:1951-1956 (1994)   
Target
Name:
Substance-K receptor
Synonyms:
NK-2 receptor NK2R NKNAR Neurokinin A receptor Neurokinin-2 (NK-2) SKR TACR2 Tachykinin receptor 2 (NK2) | hnk-3
Type:
Protein
Mol. Mass.:
44455.78
Organism:
Homo sapiens (Human)
Description:
P21452
Residue:
398
  
Inhibitor
Name:
BDBM50212987
Synonyms:
CHEMBL2110370 | GR-159897
Type:
Small organic molecule
Emp. Form.:
C23H27FN2O2S
Mol. Mass.:
414.536
SMILES:
COC1(C[S@@+]([O-])c2ccccc2)CCN(CCc2c[nH]c3ccc(F)cc23)CC1
: