Target
Alpha-1A adrenergic receptor
Ligand
BDBM50212993
Substrate
Meas. Tech.
ChEMBL_33881 (CHEMBL643753)
Ki
3802±n/a nM
Citation
  TBA Bioorg Med Chem Lett 4:2317-2322 (1994)   
Target
Name:
Alpha-1A adrenergic receptor
Synonyms:
ADA1A_HUMAN ADRA1C Alpha 1A-adrenoceptor Alpha adrenergic receptor 1a Alpha-adrenergic receptor 1c adrenergic Alpha1 | adrenergic Alpha1C
Type:
Cell-surface receptors
Mol. Mass.:
51511.67
Organism:
Homo sapiens (Human)
Description:
P35348
Residue:
466
  
Inhibitor
Name:
BDBM50212993
Synonyms:
CHEMBL305928
Type:
Small organic molecule
Emp. Form.:
C10H18N2O
Mol. Mass.:
182.2627
SMILES:
C1CN=C(NC2CCCCCC2)O1
: