Target
Alpha-2B adrenergic receptor
Ligand
BDBM50212997
Substrate
Meas. Tech.
ChEMBL_33370 (CHEMBL645108)
Ki
5.9±n/a nM
Citation
  TBA Bioorg Med Chem Lett 4:2317-2322 (1994)   
Target
Name:
Alpha-2B adrenergic receptor
Synonyms:
ADA2B_HUMAN ADRA2L1 Adrenergic alpha2B Adrenergic receptor alpha Alpha-2 adrenergic receptor subtype C2 Alpha-2B adrenoreceptor | Alpha-2BAR
Type:
Enzyme
Mol. Mass.:
49964.20
Organism:
Homo sapiens (Human)
Description:
P18089
Residue:
450
  
Inhibitor
Name:
BDBM50212997
Synonyms:
CHEMBL310335
Type:
Small organic molecule
Emp. Form.:
C12H22N2O
Mol. Mass.:
210.3159
SMILES:
CCC[C@H]1CCCCC1NC1=NCCO1
: