Target
Alpha-1B adrenergic receptor
Ligand
BDBM50070328
Substrate
Meas. Tech.
ChEMBL_34607 (CHEMBL645566)
Ki
21400±n/a nM
Citation
  TBA Bioorg Med Chem Lett 4:2317-2322 (1994)   
Target
Name:
Alpha-1B adrenergic receptor
Synonyms:
ADA1B_HUMAN Adrenergic alpha1B Adrenergic receptor alpha Alpha 1B-adrenoreceptor | Alpha-1B adrenergic receptor
Type:
Enzyme
Mol. Mass.:
56862.13
Organism:
Homo sapiens (Human)
Description:
P35368
Residue:
520
  
Inhibitor
Name:
BDBM50070328
Synonyms:
CHEBI:8862 | Rilmenidine
Type:
Small organic molecule
Emp. Form.:
C10H16N2O
Mol. Mass.:
180.2468
SMILES:
C1CC1C(NC1=NCCO1)C1CC1
: