Target
Alpha-2A adrenergic receptor
Ligand
BDBM50212996
Substrate
Meas. Tech.
ChEMBL_33204 (CHEMBL643229)
Ki
26±n/a nM
Citation
  TBA Bioorg Med Chem Lett 4:2317-2322 (1994)   
Target
Name:
Alpha-2A adrenergic receptor
Synonyms:
ADA2A_HUMAN ADRA2R Adrenergic alpha2A Alpha-2 adrenergic receptor subtype C10 Alpha-2A adrenoreceptor alpha-2A adrenergic receptor [Homo sapiens]
Type:
Enzyme
Mol. Mass.:
48979.91
Organism:
Homo sapiens (Human)
Description:
P08913
Residue:
465
  
Inhibitor
Name:
BDBM50212996
Synonyms:
CHEMBL306377
Type:
Small organic molecule
Emp. Form.:
C14H18N2O
Mol. Mass.:
230.3055
SMILES:
C1COC(NC2CCCc3ccccc23)=NC1
: