Target
Alpha-2B adrenergic receptor
Ligand
BDBM50213344
Substrate
Meas. Tech.
ChEMBL_33513 (CHEMBL648606)
Ki
3162±n/a nM
Citation
  TBA Bioorg Med Chem Lett 5:1853-1856 (1995)   
Target
Name:
Alpha-2B adrenergic receptor
Synonyms:
ADA2B_HUMAN ADRA2L1 Adrenergic alpha2B Adrenergic receptor alpha Alpha-2 adrenergic receptor subtype C2 Alpha-2B adrenoreceptor | Alpha-2BAR
Type:
Enzyme
Mol. Mass.:
49964.20
Organism:
Homo sapiens (Human)
Description:
P18089
Residue:
450
  
Inhibitor
Name:
BDBM50213344
Synonyms:
CHEMBL294649
Type:
Small organic molecule
Emp. Form.:
C18H21N3O2
Mol. Mass.:
311.3782
SMILES:
Cn1cc(C(=O)C(=O)N[C@H]2CN3CCC2CC3)c2ccccc12
: