Target
Alpha-1A adrenergic receptor
Ligand
BDBM50213344
Substrate
Meas. Tech.
ChEMBL_34183 (CHEMBL649043)
Ki
<10000±n/a nM
Citation
  TBA Bioorg Med Chem Lett 5:1853-1856 (1995)   
Target
Name:
Alpha-1A adrenergic receptor
Synonyms:
ADA1A_HUMAN ADRA1C Alpha 1A-adrenoceptor Alpha adrenergic receptor 1a Alpha-adrenergic receptor 1c adrenergic Alpha1 | adrenergic Alpha1C
Type:
Cell-surface receptors
Mol. Mass.:
51511.67
Organism:
Homo sapiens (Human)
Description:
P35348
Residue:
466
  
Inhibitor
Name:
BDBM50213344
Synonyms:
CHEMBL294649
Type:
Small organic molecule
Emp. Form.:
C18H21N3O2
Mol. Mass.:
311.3782
SMILES:
Cn1cc(C(=O)C(=O)N[C@H]2CN3CCC2CC3)c2ccccc12
: