Target
Alpha-2C adrenergic receptor
Ligand
BDBM50213346
Substrate
Meas. Tech.
ChEMBL_33664 (CHEMBL649245)
Ki
48978±n/a nM
Citation
  TBA Bioorg Med Chem Lett 5:2255-2258 (1995)   
Target
Name:
Alpha-2C adrenergic receptor
Synonyms:
ADA2C_HUMAN ADRA2L2 Adrenergic alpha2C Adrenergic receptor alpha Alpha-2 adrenergic receptor subtype C4 Alpha-2C adrenoreceptor | adrenergic, alpha-2C-, receptor [Homo sapiens]
Type:
Enzyme
Mol. Mass.:
49552.32
Organism:
Homo sapiens (Human)
Description:
P18825
Residue:
462
  
Inhibitor
Name:
BDBM50213346
Synonyms:
CHEMBL73164
Type:
Small organic molecule
Emp. Form.:
C11H9BrN4O
Mol. Mass.:
293.119
SMILES:
Brc1c(NC2=NCCO2)ccc2nccnc12
: