Target
Alpha-2C adrenergic receptor
Ligand
BDBM50213349
Substrate
Meas. Tech.
ChEMBL_33664 (CHEMBL649245)
Ki
11482±n/a nM
Citation
  TBA Bioorg Med Chem Lett 5:2255-2258 (1995)   
Target
Name:
Alpha-2C adrenergic receptor
Synonyms:
ADA2C_HUMAN ADRA2L2 Adrenergic alpha2C Adrenergic receptor alpha Alpha-2 adrenergic receptor subtype C4 Alpha-2C adrenoreceptor | adrenergic, alpha-2C-, receptor [Homo sapiens]
Type:
Enzyme
Mol. Mass.:
49552.32
Organism:
Homo sapiens (Human)
Description:
P18825
Residue:
462
  
Inhibitor
Name:
BDBM50213349
Synonyms:
CHEMBL74342
Type:
Small organic molecule
Emp. Form.:
C15H16BrN5
Mol. Mass.:
346.225
SMILES:
[H][C@]12CCCC[C@@]1([H])N=C(Nc1ccc3nccnc3c1Br)N2
: