Target
D(1A) dopamine receptor
Ligand
BDBM50213354
Substrate
Meas. Tech.
ChEMBL_58821 (CHEMBL668244)
Ki
575±n/a nM
Citation
  TBA Bioorg Med Chem Lett 5:2371-2376 (1995)   
Target
Name:
D(1A) dopamine receptor
Synonyms:
DOPAMINE D1 Dopamine D1 high Dopamine receptor Dopamine1-like Drd1a
Type:
Enzyme Catalytic Domain
Mol. Mass.:
49429.75
Organism:
RAT
Description:
P18901
Residue:
446
  
Inhibitor
Name:
BDBM50213354
Synonyms:
CHEMBL80974
Type:
Small organic molecule
Emp. Form.:
C28H40N2O4
Mol. Mass.:
468.6282
SMILES:
Oc1ccc(C[C@H]2CCCN2CCCCCCN2CCC[C@H]2Cc2ccc(O)c(O)c2)cc1O
: