Target
Adenosine receptor A2b
Ligand
BDBM50213354
Substrate
Meas. Tech.
ChEMBL_32937 (CHEMBL646079)
Ki
933±n/a nM
Citation
  TBA Bioorg Med Chem Lett 5:2371-2376 (1995)   
Target
Name:
Adenosine receptor A2b
Synonyms:
AA2BR_RAT Adora2b
Type:
PROTEIN
Mol. Mass.:
36378.84
Organism:
Rattus norvegicus
Description:
ChEMBL_32934
Residue:
332
  
Inhibitor
Name:
BDBM50213354
Synonyms:
CHEMBL80974
Type:
Small organic molecule
Emp. Form.:
C28H40N2O4
Mol. Mass.:
468.6282
SMILES:
Oc1ccc(C[C@H]2CCCN2CCCCCCN2CCC[C@H]2Cc2ccc(O)c(O)c2)cc1O
: