Target
Histamine H2 receptor
Ligand
BDBM50213959
Substrate
Meas. Tech.
ChEBML_85064
IC50
809±n/a nM
Citation
  TBA Bioorg Med Chem Lett 6:1795-1798 (1996)   
Target
Name:
Histamine H2 receptor
Synonyms:
Gastric receptor I HISTAMINE H2 HRH2_CAVPO | Histamine H2-Gs alpha S
Type:
G Protein-Coupled Receptor (GPCR)
Mol. Mass.:
40567.22
Organism:
Cavia porcellus (domestic guinea pig)
Description:
For the H2 receptor-binding assays, guinea pig striatum was used.
Residue:
359
  
Inhibitor
Name:
BDBM50213959
Synonyms:
CHEMBL50294
Type:
Small organic molecule
Emp. Form.:
C22H32N4O3S
Mol. Mass.:
432.579
SMILES:
CN(C)CC\N=c1/c(O)c(O)c1=NC\C=C/COc1csc(CN2CCCCC2)c1
: