Target
Glutamate receptor ionotropic, NMDA 1
Ligand
BDBM50214325
Substrate
Meas. Tech.
ChEMBL_140328 (CHEMBL858425)
Ki
112±n/a nM
Citation
  TBA Bioorg Med Chem Lett 6:2749-2754 (1996)   
Target
Name:
Glutamate receptor ionotropic, NMDA 1
Synonyms:
Glutamate (NMDA) receptor subunit zeta 1 Glutamate-NMDA-Channel Glutamate-NMDA-Polyamine NMDA Nmdar1 | phencyclidine
Type:
Enzyme Catalytic Domain
Mol. Mass.:
105533.40
Organism:
RAT
Description:
P35439
Residue:
938
  
Inhibitor
Name:
BDBM50214325
Synonyms:
CHEMBL328571
Type:
Small organic molecule
Emp. Form.:
C7H3BrClN3O3
Mol. Mass.:
292.474
SMILES:
Oc1nc2cc(Br)c(Cl)[n+]([O-])c2nc1O
: