Target
Glutamate receptor ionotropic, NMDA 1
Ligand
BDBM50214339
Substrate
Meas. Tech.
ChEMBL_140328 (CHEMBL858425)
Ki
741±n/a nM
Citation
  TBA Bioorg Med Chem Lett 6:2749-2754 (1996)   
Target
Name:
Glutamate receptor ionotropic, NMDA 1
Synonyms:
Glutamate (NMDA) receptor subunit zeta 1 Glutamate-NMDA-Channel Glutamate-NMDA-Polyamine NMDA Nmdar1 | phencyclidine
Type:
Enzyme Catalytic Domain
Mol. Mass.:
105533.40
Organism:
RAT
Description:
P35439
Residue:
938
  
Inhibitor
Name:
BDBM50214339
Synonyms:
CHEMBL432648
Type:
Small organic molecule
Emp. Form.:
C7H4IN3O3
Mol. Mass.:
305.0294
SMILES:
Oc1nc2cc(I)c[n+]([O-])c2nc1O
: