Target
Estrogen receptor beta
Ligand
BDBM50215104
Substrate
Meas. Tech.
ChEBML_99778
IC50
0.800000±n/a nM
Citation
  TBA Bioorg Med Chem Lett 7:887-892 (1997)   
Target
Name:
Estrogen receptor beta
Synonyms:
Estrogen receptor
Type:
Mol. Mass.:
Description:
ASSAY_ID of ChEMBL is 99778
Components:
This complex has 2 components.
Component 1
Name:
Estrogen receptor beta
Synonyms:
ER-beta ESR2_HUMAN Estradiol receptor beta (ERβ) Estrogen receptor (ER beta) Estrogen receptor beta (ER beta) NR3A2 estrogen beta
Type:
Protein
Mol. Mass.:
59238.43
Organism:
Homo sapiens (Human)
Description:
Q92731
Residue:
530
  
Component 2
Name:
Estrogen receptor
Synonyms:
ER ESR ESR1_HUMAN Estrogen receptor Estrogen receptor (ER-alpha) Estrogen receptor alpha (ER) Nuclear receptor subfamily 3 group A member 1
Type:
Protein
Mol. Mass.:
66230.44
Organism:
Homo sapiens (Human)
Description:
P03372
Residue:
595
  
Inhibitor
Name:
BDBM50215104
Synonyms:
CHEMBL43779
Type:
Small organic molecule
Emp. Form.:
C30H27NO3S
Mol. Mass.:
481.605
SMILES:
Oc1ccc2c(C(=O)c3ccc(OCCN4CCCCC4)cc3)c(sc2c1)-c1ccc(cc1)C#C
: